Reaction Details
TargetP2X purinoceptor 7
LigandBDBM48901
Substrate/Competitorn/a
Meas. Tech.ChEMBL_1543891 (CHEMBL3749873)
IC50 0.500000±n/a nM
Citation Ameriks, MKAo, HCarruthers, NILord, BRavula, SRech, JCSavall, BMWall, JLWang, QBhattacharya, ALetavic, MA Preclinical characterization of substituted 6,7-dihydro-[1,2,4]triazolo[4,3-a]pyrazin-8(5H)-one P2X7 receptor antagonists. Bioorg Med Chem Lett26:257-61 (2016) 
 
P2X purinoceptor 7
Name:P2X purinoceptor 7
Type:Protein
Mol. Mass.:68602.85
Organism:Homo sapiens (Human)
Description:Q99572
Residue:595
BDBM48901
NameBDBM48901
Synonyms:BDBM160086 US10053463, 27 | US9040534, 72
Typen/a
Emp. Form.C18H14ClF3N6O
Mol. Mass.422.792
SMILESC[C@H]1Cn2c(nnc2-c2ncccn2)C(=O)N1Cc1cccc(c1Cl)C(F)(F)F