Reaction Details
TargetVitamin D3 receptor
LigandBDBM50135031
Substrate/Competitorn/a
Meas. Tech.ChEMBL_1544902 (CHEMBL3751598)
IC50 13±n/a nM
Citation Watarai, YIshizawa, MIkura, TZacconi, FCUno, SIto, NMouriņo, ATokiwa, HMakishima, MYamada, S Synthesis, Biological Activities, and X-ray Crystal Structural Analysis of 25-Hydroxy-25(or 26)-adamantyl-17-[20(22),23-diynyl]-21-norvitamin D Compounds. J Med Chem58:9510-21 (2015) 
 
Vitamin D3 receptor
Name:Vitamin D3 receptor
Type:Protein
Mol. Mass.:48288.72
Organism:Homo sapiens (Human)
Description:P11473
Residue:427
BDBM50135031
NameBDBM50135031
Synonyms:CHEMBL3747243
TypeSmall organic molecule
Emp. Form.C34H44O3
Mol. Mass.500.7114
SMILES[H][C@@]12[#6]-[#6]-[#6@H](C#CC#C[#6@H](-[#8])C34[#6]-[#6]-5-[#6]-[#6](-[#6]-[#6](-[#6]-5)-[#6]3)-[#6]4)[C@@]1([#6])[#6]-[#6]-[#6]\[#6]2=[#6]/[#6]=[#6]-1/[#6]-[#6@@H](-[#8])-[#6](=[#6])-[#6@H](-[#8])-[#6]-1