Reaction Details
TargetSphingosine 1-phosphate receptor 1
LigandBDBM50136454
Substrate/Competitorn/a
Meas. Tech.ChEMBL_1548095 (CHEMBL3757927)
EC50 14±n/a nM
Citation Horan, JCKuzmich, DLiu, PDiSalvo, DLord, JMao, CHopkins, TDYu, HHarcken, CBetageri, RHill-Drzewi, MPatenaude, LPatel, MFletcher, KTerenzzio, DLinehan, BXia, HPatel, MStudwell, DMiller, CHickey, ELevin, JISmith, DKemper, RAModis, LKBannen, LCChan, DSMac, MBNg, SWang, YXu, WLemieux, RM Late-stage optimization of a tercyclic class of S1P3-sparing, S1P1 receptor agonists. Bioorg Med Chem Lett26:466-71 (2016) 
 
Sphingosine 1-phosphate receptor 1
Name:Sphingosine 1-phosphate receptor 1
Type:Enzyme
Mol. Mass.:42836.02
Organism:Homo sapiens (Human)
Description:P21453
Residue:382
BDBM50136454
NameBDBM50136454
Synonyms:CHEMBL3754266
TypeSmall organic molecule
Emp. Form.C22H23ClFN5O4
Mol. Mass.475.901
SMILESCC(C)Nc1cc(cc(C)n1)-c1nc(no1)-c1cc(F)c(OC[C@H]2CNC(=O)CO2)cc1Cl