Reaction Details
TargetSphingosine 1-phosphate receptor 1
LigandBDBM50136512
Substrate/Competitorn/a
Meas. Tech.ChEMBL_1548095 (CHEMBL3757927)
EC50 3.5±n/a nM
Citation Horan, JCKuzmich, DLiu, PDiSalvo, DLord, JMao, CHopkins, TDYu, HHarcken, CBetageri, RHill-Drzewi, MPatenaude, LPatel, MFletcher, KTerenzzio, DLinehan, BXia, HPatel, MStudwell, DMiller, CHickey, ELevin, JISmith, DKemper, RAModis, LKBannen, LCChan, DSMac, MBNg, SWang, YXu, WLemieux, RM Late-stage optimization of a tercyclic class of S1P3-sparing, S1P1 receptor agonists. Bioorg Med Chem Lett26:466-71 (2016) 
 
Sphingosine 1-phosphate receptor 1
Name:Sphingosine 1-phosphate receptor 1
Type:Enzyme
Mol. Mass.:42836.02
Organism:Homo sapiens (Human)
Description:P21453
Residue:382
BDBM50136512
NameBDBM50136512
Synonyms:CHEMBL3752499
TypeSmall organic molecule
Emp. Form.C21H21ClFN5O3
Mol. Mass.445.875
SMILESCC(C)Nc1cc(cc(C)n1)-c1nc(no1)-c1cc(F)c(O[C@@H]2CNC(=O)C2)cc1Cl