Reaction Details
TargetSphingosine 1-phosphate receptor 1
LigandBDBM50136540
Substrate/Competitorn/a
Meas. Tech.ChEMBL_1548095 (CHEMBL3757927)
EC50 2.8±n/a nM
Citation Horan, JCKuzmich, DLiu, PDiSalvo, DLord, JMao, CHopkins, TDYu, HHarcken, CBetageri, RHill-Drzewi, MPatenaude, LPatel, MFletcher, KTerenzzio, DLinehan, BXia, HPatel, MStudwell, DMiller, CHickey, ELevin, JISmith, DKemper, RAModis, LKBannen, LCChan, DSMac, MBNg, SWang, YXu, WLemieux, RM Late-stage optimization of a tercyclic class of S1P3-sparing, S1P1 receptor agonists. Bioorg Med Chem Lett26:466-71 (2016) 
 
Sphingosine 1-phosphate receptor 1
Name:Sphingosine 1-phosphate receptor 1
Type:Enzyme
Mol. Mass.:42836.02
Organism:Homo sapiens (Human)
Description:P21453
Residue:382
BDBM50136540
NameBDBM50136540
Synonyms:CHEMBL3753059
TypeSmall organic molecule
Emp. Form.C21H23N5O4
Mol. Mass.409.4384
SMILESCC(C)Nc1cc(cc(C)n1)-c1nc(no1)-c1ccc(OC[C@H]2COC(=O)N2)cc1