Reaction Details
TargetSphingosine 1-phosphate receptor 3
LigandBDBM50136551
Substrate/Competitorn/a
Meas. Tech.ChEMBL_1548096 (CHEMBL3757928)
EC50>10000±n/a nM
Citation Horan, JCKuzmich, DLiu, PDiSalvo, DLord, JMao, CHopkins, TDYu, HHarcken, CBetageri, RHill-Drzewi, MPatenaude, LPatel, MFletcher, KTerenzzio, DLinehan, BXia, HPatel, MStudwell, DMiller, CHickey, ELevin, JISmith, DKemper, RAModis, LKBannen, LCChan, DSMac, MBNg, SWang, YXu, WLemieux, RM Late-stage optimization of a tercyclic class of S1P3-sparing, S1P1 receptor agonists. Bioorg Med Chem Lett26:466-71 (2016) 
 
Sphingosine 1-phosphate receptor 3
Name:Sphingosine 1-phosphate receptor 3
Type:G Protein-Coupled Receptor (GPCR)
Mol. Mass.:42278.13
Organism:Homo sapiens (Human)
Description:Q99500
Residue:378
BDBM50136551
NameBDBM50136551
Synonyms:CHEMBL3753609
TypeSmall organic molecule
Emp. Form.C22H26N6O3
Mol. Mass.422.4802
SMILESCC(C)Nc1cc(cc(C)n1)-c1nc(no1)-c1ccc(O[C@H]2CCC(=O)NC2)c(C)n1