Reaction Details
TargetProstaglandin E synthase
LigandBDBM50140687
Substrate/Competitorn/a
Meas. Tech.ChEMBL_1548641 (CHEMBL3757641)
IC50 3600±n/a nM
Citation Di Micco, SSpatafora, CCardullo, NRiccio, RFischer, KPergola, CKoeberle, AWerz, OChalal, MVervandier-Fasseur, DTringali, CBifulco, G 2,3-Dihydrobenzofuran privileged structures as new bioinspired lead compounds for the design of mPGES-1 inhibitors. Bioorg Med Chem24:820-6 (2016) 
 
Prostaglandin E synthase
Name:Prostaglandin E synthase
Type:Protein
Mol. Mass.:17112.22
Organism:Homo sapiens (Human)
Description:n/a
Residue:152
BDBM50140687
NameBDBM50140687
Synonyms:CHEMBL3752388
TypeSmall organic molecule
Emp. Form.C22H22O8
Mol. Mass.414.4053
SMILESCCOC(=O)\C=C\c1cc2[C@H]([C@@H](Oc2c(O)c1)c1ccc(O)c(O)c1)C(=O)OCC