Reaction Details
TargetProstaglandin E synthase
LigandBDBM50140689
Substrate/Competitorn/a
Meas. Tech.ChEMBL_1548641 (CHEMBL3757641)
IC50 2000±n/a nM
Citation Di Micco, SSpatafora, CCardullo, NRiccio, RFischer, KPergola, CKoeberle, AWerz, OChalal, MVervandier-Fasseur, DTringali, CBifulco, G 2,3-Dihydrobenzofuran privileged structures as new bioinspired lead compounds for the design of mPGES-1 inhibitors. Bioorg Med Chem24:820-6 (2016) 
 
Prostaglandin E synthase
Name:Prostaglandin E synthase
Type:Protein
Mol. Mass.:17112.22
Organism:Homo sapiens (Human)
Description:n/a
Residue:152
BDBM50140689
NameBDBM50140689
Synonyms:CHEMBL3752809
TypeSmall organic molecule
Emp. Form.C34H30O8
Mol. Mass.566.5972
SMILESOc1cc(\C=C\C(=O)OCCc2ccccc2)cc2[C@H]([C@@H](Oc12)c1ccc(O)c(O)c1)C(=O)OCCc1ccccc1