Reaction Details
TargetProstaglandin E synthase
LigandBDBM50028854
Substrate/Competitorn/a
Meas. Tech.ChEMBL_1552424 (CHEMBL3761675)
IC50 12±n/a nM
Citation Schiffler, MAAntonysamy, SBhattachar, SNCampanale, KMChandrasekhar, SCondon, BDesai, PVFisher, MJGroshong, CHarvey, AHickey, MJHughes, NEJones, SAKim, EJKuklish, SLLuz, JGNorman, BHRathmell, RERizzo, JRSeng, TWThibodeaux, SJWoods, TAYork, JSYu, XP Discovery and Characterization of 2-Acylaminoimidazole Microsomal Prostaglandin E Synthase-1 Inhibitors. J Med Chem59:194-205 (2016) 
 
Prostaglandin E synthase
Name:Prostaglandin E synthase
Type:Protein
Mol. Mass.:17112.22
Organism:Homo sapiens (Human)
Description:n/a
Residue:152
BDBM50028854
NameBDBM50028854
Synonyms:CHEMBL3342693
TypeSmall organic molecule
Emp. Form.C23H22F5N5O2
Mol. Mass.495.4451
SMILESCC(C)C(=O)NCc1cnc(C(F)F)c(c1)C(=O)Nc1nc(C)c([nH]1)-c1ccc(cc1)C(F)(F)F