Reaction Details
TargetProstaglandin G/H synthase 2
LigandBDBM50142937
Substrate/Competitorn/a
Meas. Tech.ChEMBL_1552871 (CHEMBL3760914)
IC50 13±n/a nM
Citation Di Capua, ASticozzi, CBrogi, SBrindisi, MCappelli, ASautebin, LRossi, APace, SGhelardini, CDi Cesare Mannelli, LValacchi, GGiorgi, GGiordani, APoce, GBiava, MAnzini, M Synthesis and biological evaluation of fluorinated 1,5-diarylpyrrole-3-alkoxyethyl ether derivatives as selective COX-2 inhibitors endowed with anti-inflammatory activity. Eur J Med Chem109:99-106 (2016) 
 
Prostaglandin G/H synthase 2
Name:Prostaglandin G/H synthase 2
Type:Protein
Mol. Mass.:69020.39
Organism:Mus musculus (Mouse)
Description:Q05769
Residue:604
BDBM50142937
NameBDBM50142937
Synonyms:CHEMBL3759726
TypeSmall organic molecule
Emp. Form.C23H26FNO3S
Mol. Mass.415.521
SMILESCCCOCCc1cc(-c2ccc(cc2)S(C)(=O)=O)n(c1C)-c1cccc(F)c1