Reaction Details
TargetTyrosine-protein kinase receptor UFO
LigandBDBM50143216
Substrate/Competitorn/a
Meas. Tech.ChEMBL_1550514 (CHEMBL3762052)
IC50>1000±n/a nM
Citation Liu, YJin, SPeng, XLu, DZeng, LSun, YAi, JGeng, MHu, Y Pyridazinone derivatives displaying highly potent and selective inhibitory activities against c-Met tyrosine kinase. Eur J Med Chem108:322-33 (2016) 
 
Tyrosine-protein kinase receptor UFO
Name:Tyrosine-protein kinase receptor UFO
Type:Enzyme
Mol. Mass.:98316.97
Organism:Homo sapiens (Human)
Description:P30530
Residue:894
BDBM50143216
NameBDBM50143216
Synonyms:CHEMBL3759079
TypeSmall organic molecule
Emp. Form.C23H21N9O
Mol. Mass.439.4725
SMILESCn1cc(cn1)-c1cnc(Nc2cccc(Cn3nc(ccc3=O)-c3cnn(C)c3)c2)nc1