Reaction Details
TargetHepatocyte growth factor receptor
LigandBDBM50143246
Substrate/Competitorn/a
Meas. Tech.ChEMBL_1550500 (CHEMBL3762038)
IC50 82±n/a nM
Citation Liu, YJin, SPeng, XLu, DZeng, LSun, YAi, JGeng, MHu, Y Pyridazinone derivatives displaying highly potent and selective inhibitory activities against c-Met tyrosine kinase. Eur J Med Chem108:322-33 (2016) 
 
Hepatocyte growth factor receptor
Name:Hepatocyte growth factor receptor
Type:Protein
Mol. Mass.:155559.73
Organism:Homo sapiens (Human)
Description:P08581
Residue:1390
BDBM50143246
NameBDBM50143246
Synonyms:CHEMBL3759320
TypeSmall organic molecule
Emp. Form.C22H23N7O3
Mol. Mass.433.4631
SMILESCOCCOc1cnc(Nc2cccc(Cn3nc(ccc3=O)-c3cnn(C)c3)c2)nc1