Reaction Details
TargetHepatocyte growth factor receptor
LigandBDBM50143249
Substrate/Competitorn/a
Meas. Tech.ChEMBL_1550500 (CHEMBL3762038)
IC50 4.3±n/a nM
Citation Liu, YJin, SPeng, XLu, DZeng, LSun, YAi, JGeng, MHu, Y Pyridazinone derivatives displaying highly potent and selective inhibitory activities against c-Met tyrosine kinase. Eur J Med Chem108:322-33 (2016) 
 
Hepatocyte growth factor receptor
Name:Hepatocyte growth factor receptor
Type:Protein
Mol. Mass.:155559.73
Organism:Homo sapiens (Human)
Description:P08581
Residue:1390
BDBM50143249
NameBDBM50143249
Synonyms:CHEMBL3759495
TypeSmall organic molecule
Emp. Form.C28H30N10O
Mol. Mass.522.6042
SMILESCN1CCC(CC1)n1cc(cn1)-c1cnc(Nc2cccc(Cn3nc(ccc3=O)-c3cnn(C)c3)c2)nc1