Reaction Details
TargetHepatocyte growth factor receptor
LigandBDBM50143260
Substrate/Competitorn/a
Meas. Tech.ChEMBL_1550500 (CHEMBL3762038)
IC50 28±n/a nM
Citation Liu, YJin, SPeng, XLu, DZeng, LSun, YAi, JGeng, MHu, Y Pyridazinone derivatives displaying highly potent and selective inhibitory activities against c-Met tyrosine kinase. Eur J Med Chem108:322-33 (2016) 
 
Hepatocyte growth factor receptor
Name:Hepatocyte growth factor receptor
Type:Protein
Mol. Mass.:155559.73
Organism:Homo sapiens (Human)
Description:P08581
Residue:1390
BDBM50143260
NameBDBM50143260
Synonyms:CHEMBL3758647
TypeSmall organic molecule
Emp. Form.C26H23N7O3S
Mol. Mass.513.571
SMILESCn1cc(cn1)-c1cnc(Nc2cccc(Cn3nc(ccc3=O)-c3cccc(c3)S(C)(=O)=O)c2)nc1