Reaction Details
TargetHepatocyte growth factor receptor
LigandBDBM50143263
Substrate/Competitorn/a
Meas. Tech.ChEMBL_1550500 (CHEMBL3762038)
IC50 3.6±n/a nM
Citation Liu, YJin, SPeng, XLu, DZeng, LSun, YAi, JGeng, MHu, Y Pyridazinone derivatives displaying highly potent and selective inhibitory activities against c-Met tyrosine kinase. Eur J Med Chem108:322-33 (2016) 
 
Hepatocyte growth factor receptor
Name:Hepatocyte growth factor receptor
Type:Protein
Mol. Mass.:155559.73
Organism:Homo sapiens (Human)
Description:P08581
Residue:1390
BDBM50143263
NameBDBM50143263
Synonyms:CHEMBL3758464
TypeSmall organic molecule
Emp. Form.C27H23FN8O2
Mol. Mass.510.5223
SMILESCNC(=O)c1ccc(cc1F)-c1ccc(=O)n(Cc2cccc(Nc3ncc(cn3)-c3cnn(C)c3)c2)n1