Reaction Details
Target5-hydroxytryptamine receptor 7
LigandBDBM50143372
Substrate/Competitorn/a
Meas. Tech.ChEMBL_1550541 (CHEMBL3762236)
Ki 2.0±n/a nM
Citation Canale, VKurczab, RPartyka, ASatala, GLenda, TJastrzebska-Wiesek, MWesolowska, ABojarski, AJZajdel, P Towards new 5-HT7 antagonists among arylsulfonamide derivatives of (aryloxy)ethyl-alkyl amines: Multiobjective based design, synthesis, and antidepressant and anxiolytic properties. Eur J Med Chem108:334-46 (2016) 
 
5-hydroxytryptamine receptor 7
Name:5-hydroxytryptamine receptor 7
Type:G Protein-Coupled Receptor (GPCR)
Mol. Mass.:53573.08
Organism:Homo sapiens (Human)
Description:P34969
Residue:479
BDBM50143372
NameBDBM50143372
Synonyms:CHEMBL3759617
TypeSmall organic molecule
Emp. Form.C24H31FN2O3S
Mol. Mass.446.578
SMILESCC(C)c1cccc(OCCN2C3CCC2CC(C3)NS(=O)(=O)c2cccc(F)c2)c1