Reaction Details
TargetCannabinoid receptor 2
LigandBDBM50144619
Substrate/Competitorn/a
Meas. Tech.ChEMBL_1551637 (CHEMBL3760883)
Ki 1929±n/a nM
Citation Fulp, AZhang, YBortoff, KSeltzman, HSnyder, RWiethe, RAmato, GMaitra, R Pyrazole antagonists of the CB1 receptor with reduced brain penetration. Bioorg Med Chem24:1063-70 (2016) 
 
Cannabinoid receptor 2
Name:Cannabinoid receptor 2
Type:G Protein-Coupled Receptor (GPCR)
Mol. Mass.:39690.94
Organism:Homo sapiens (Human)
Description:P34972
Residue:360
BDBM50144619
NameBDBM50144619
Synonyms:CHEMBL3759785
TypeSmall organic molecule
Emp. Form.C26H27Cl3N4O3
Mol. Mass.549.877
SMILESCC(C)OC(=O)N1CCC(CC1)NC(=O)c1nn(c(c1C)-c1ccc(Cl)cc1)-c1ccc(Cl)cc1Cl