Reaction Details
TargetIndoleamine 2,3-dioxygenase 1
LigandBDBM50146454
Substrate/Competitorn/a
Meas. Tech.ChEMBL_1555048 (CHEMBL3767626)
IC50 1700±n/a nM
Citation Malachowski, WPWinters, MDuHadaway, JBLewis-Ballester, ABadir, SWai, JRahman, MSheikh, ELaLonde, JMYeh, SRPrendergast, GCMuller, AJ O-alkylhydroxylamines as rationally-designed mechanism-based inhibitors of indoleamine 2,3-dioxygenase-1. Eur J Med Chem108:564-76 (2016) 
 
Indoleamine 2,3-dioxygenase 1
Name:Indoleamine 2,3-dioxygenase 1
Type:Enzyme
Mol. Mass.:45330.80
Organism:Homo sapiens (Human)
Description:P14902
Residue:403
BDBM50146454
NameBDBM50146454
Synonyms:CHEMBL3765654
TypeSmall organic molecule
Emp. Form.C9H14ClNO3
Mol. Mass.219.665
SMILESCl.COc1ccc(OC)c(CON)c1