Reaction Details
TargetIndoleamine 2,3-dioxygenase 1
LigandBDBM50146519
Substrate/Competitorn/a
Meas. Tech.ChEMBL_1555048 (CHEMBL3767626)
IC50 900±n/a nM
Citation Malachowski, WPWinters, MDuHadaway, JBLewis-Ballester, ABadir, SWai, JRahman, MSheikh, ELaLonde, JMYeh, SRPrendergast, GCMuller, AJ O-alkylhydroxylamines as rationally-designed mechanism-based inhibitors of indoleamine 2,3-dioxygenase-1. Eur J Med Chem108:564-76 (2016) 
 
Indoleamine 2,3-dioxygenase 1
Name:Indoleamine 2,3-dioxygenase 1
Type:Enzyme
Mol. Mass.:45330.80
Organism:Homo sapiens (Human)
Description:P14902
Residue:403
BDBM50146519
NameBDBM50146519
Synonyms:CHEMBL3764853
TypeSmall organic molecule
Emp. Form.C7H8Cl3NO
Mol. Mass.228.504
SMILESCl.NOCc1cc(Cl)cc(Cl)c1