Reaction Details
TargetIndoleamine 2,3-dioxygenase 1
LigandBDBM50082143
Substrate/Competitorn/a
Meas. Tech.ChEMBL_1555048 (CHEMBL3767626)
IC50 9200±n/a nM
Citation Malachowski, WPWinters, MDuHadaway, JBLewis-Ballester, ABadir, SWai, JRahman, MSheikh, ELaLonde, JMYeh, SRPrendergast, GCMuller, AJ O-alkylhydroxylamines as rationally-designed mechanism-based inhibitors of indoleamine 2,3-dioxygenase-1. Eur J Med Chem108:564-76 (2016) 
 
Indoleamine 2,3-dioxygenase 1
Name:Indoleamine 2,3-dioxygenase 1
Type:Enzyme
Mol. Mass.:45330.80
Organism:Homo sapiens (Human)
Description:P14902
Residue:403
BDBM50082143
NameBDBM50082143
Synonyms:CHEMBL320474 N-phenylhydroxylamine | hydroxyaminobenzene
TypeSmall organic molecule
Emp. Form.C6H7NO
Mol. Mass.109.1259
SMILESONc1ccccc1