Reaction Details
TargetProtein S100-B
LigandBDBM45440
Substrate/Competitorn/a
Meas. Tech.ChEMBL_1555508 (CHEMBL3768090)
Kd 44000±n/a nM
Citation Cavalier, MCAnsari, MIPierce, ADWilder, PTMcKnight, LERaman, EPNeau, DBBezawada, PAlasady, MJCharpentier, THVarney, KMToth, EAMacKerell, ADCoop, AWeber, DJ Small Molecule Inhibitors of Ca(2+)-S100B Reveal Two Protein Conformations. J Med Chem59:592-608 (2016) 
 
Protein S100-B
Name:Protein S100-B
Type:PROTEIN
Mol. Mass.:10731.34
Organism:Rattus norvegicus
Description:ChEMBL_116732
Residue:92
BDBM45440
NameBDBM45440
Synonyms:4-[5-(4-amidinophenoxy)pentoxy]benzamidine;2-hydroxyethanesulfonic acid 4-[5-(4-carbamimidoylphenoxy)pentoxy]benzenecarboximidamide;2-oxidanylethanesulfonic acid MLS000028738 PENTAMIDINE ISETHIONATE cid_359323
TypeSmall organic molecule
Emp. Form.C19H24N4O2
Mol. Mass.340.4195
SMILESNC(=N)c1ccc(OCCCCCOc2ccc(cc2)C(N)=N)cc1