Reaction Details
TargetBromodomain-containing protein 9
LigandBDBM50148289
Substrate/Competitorn/a
Meas. Tech.ChEMBL_1557669 (CHEMBL3772738)
IC50 1400±n/a nM
Citation Chen, PChaikuad, ABamborough, PBantscheff, MBountra, CChung, CWFedorov, OGrandi, PJung, DLesniak, RLindon, MMüller, SPhilpott, MPrinjha, RRogers, CSelenski, CTallant, CWerner, TWillson, TMKnapp, SDrewry, DH Discovery and Characterization of GSK2801, a Selective Chemical Probe for the Bromodomains BAZ2A and BAZ2B. J Med Chem59:1410-24 (2016) 
 
Bromodomain-containing protein 9
Name:Bromodomain-containing protein 9
Type:PROTEIN
Mol. Mass.:66994.30
Organism:Homo sapiens (Human)
Description:ChEMBL_108000
Residue:597
BDBM50148289
NameBDBM50148289
Synonyms:CHEMBL3770199
TypeSmall organic molecule
Emp. Form.C23H26N2O5S
Mol. Mass.442.528
SMILESCC(=O)c1cc(-c2ccccc2S(C)(=O)=O)c2cc(CNC(=O)OC(C)(C)C)ccn12