Reaction Details
TargetHistone deacetylase 6
LigandBDBM50148617
Substrate/Competitorn/a
Meas. Tech.ChEMBL_1556878 (CHEMBL3771760)
IC50 81±n/a nM
Citation Senger, JMelesina, JMarek, MRomier, COehme, IWitt, OSippl, WJung, M Synthesis and Biological Investigation of Oxazole Hydroxamates as Highly Selective Histone Deacetylase 6 (HDAC6) Inhibitors. J Med Chem59:1545-55 (2016) 
 
Histone deacetylase 6
Name:Histone deacetylase 6
Type:Chromatin regulator; hydrolase; repressor
Mol. Mass.:131381.51
Organism:Homo sapiens (Human)
Description:Q9UBN7
Residue:1215
BDBM50148617
NameBDBM50148617
Synonyms:CHEMBL3771189
TypeSmall organic molecule
Emp. Form.C10H7ClN2O3
Mol. Mass.238.627
SMILESONC(=O)c1coc(n1)-c1ccc(Cl)cc1