Reaction Details
TargetEgl nine homolog 1
LigandBDBM50193145
Substrate/Competitorn/a
Meas. Tech.ChEMBL_1557602 (CHEMBL3772519)
IC50 424±n/a nM
Citation Lei, YHu, TWu, XWu, YBao, QZhang, LXia, HSun, HYou, QZhang, X Affinity-Based Fluorescence Polarization Assay for High-Throughput Screening of Prolyl Hydroxylase 2 Inhibitors. ACS Med Chem Lett6:1236-40 (2015) 
 
Egl nine homolog 1
Name:Egl nine homolog 1
Type:Protein
Mol. Mass.:46035.59
Organism:Homo sapiens (Human)
Description:Q9GZT9
Residue:426
BDBM50193145
NameBDBM50193145
Synonyms:2-(1-chloro-4-hydroxyisoquinoline-3-carboxamido)acetic acid Isoquinoline 3 | N-[(1-CHLORO-4-HYDROXYISOQUINOLIN-3-YL)CARBONYL]GLYCINE
TypeSmall organic molecule
Emp. Form.C12H9ClN2O4
Mol. Mass.280.664
SMILESOC(=O)CNC(=O)c1nc(Cl)c2ccccc2c1O