Reaction Details
TargetSerine/threonine-protein kinase PAK 1
LigandBDBM50148919
Substrate/Competitorn/a
Meas. Tech.ChEMBL_1557608 (CHEMBL3772525)
Ki 4.3±n/a nM
Citation Ndubaku, COCrawford, JJDrobnick, JAliagas, ICampbell, DDong, PDornan, LMDuron, SEpler, JGazzard, LHeise, CEHoeflich, KPJakubiak, DLa, HLee, WLin, BLyssikatos, JPMaksimoska, JMarmorstein, RMurray, LJO'Brien, TOh, ARamaswamy, SWang, WZhao, XZhong, YBlackwood, ERudolph, J Design of Selective PAK1 Inhibitor G-5555: Improving Properties by Employing an Unorthodox Low-pK a Polar Moiety. ACS Med Chem Lett6:1241-6 (2015) 
 
Serine/threonine-protein kinase PAK 1
Name:Serine/threonine-protein kinase PAK 1
Type:n/a
Mol. Mass.:60640.15
Organism:Homo sapiens (Human)
Description:Q13153
Residue:545
BDBM50148919
NameBDBM50148919
Synonyms:CHEMBL3770363
TypeSmall organic molecule
Emp. Form.C27H27ClN6O3
Mol. Mass.518.995
SMILESCNc1ncc2cc(-c3ccc(cc3Cl)-c3cccc(C)n3)c(=O)n(CC3COC4(CNC4)OC3)c2n1