Reaction Details
TargetSerine/threonine-protein kinase PAK 1
LigandBDBM50148927
Substrate/Competitorn/a
Meas. Tech.ChEMBL_1557608 (CHEMBL3772525)
Ki 2.1±n/a nM
Citation Ndubaku, COCrawford, JJDrobnick, JAliagas, ICampbell, DDong, PDornan, LMDuron, SEpler, JGazzard, LHeise, CEHoeflich, KPJakubiak, DLa, HLee, WLin, BLyssikatos, JPMaksimoska, JMarmorstein, RMurray, LJO'Brien, TOh, ARamaswamy, SWang, WZhao, XZhong, YBlackwood, ERudolph, J Design of Selective PAK1 Inhibitor G-5555: Improving Properties by Employing an Unorthodox Low-pK a Polar Moiety. ACS Med Chem Lett6:1241-6 (2015) 
 
Serine/threonine-protein kinase PAK 1
Name:Serine/threonine-protein kinase PAK 1
Type:n/a
Mol. Mass.:60640.15
Organism:Homo sapiens (Human)
Description:Q13153
Residue:545
BDBM50148927
NameBDBM50148927
Synonyms:CHEMBL3770588
TypeSmall organic molecule
Emp. Form.C28H31ClN6O
Mol. Mass.503.038
SMILESCCNc1ncc2cc(-c3ccc(cc3Cl)-c3cccc(C)n3)c(=O)n(C[C@H]3CC[C@H](N)CC3)c2n1