Reaction Details
TargetSolute carrier family 13 member 5
LigandBDBM50149215
Substrate/Competitorn/a
Meas. Tech.ChEMBL_1557732 (CHEMBL3773091)
IC50 800±n/a nM
Citation Huard, KGosset, JRMontgomery, JIGilbert, AHayward, MMMagee, TVCabral, SUccello, DPBahnck, KBrown, JPurkal, JGorgoglione, MLanba, AFutatsugi, KHerr, MGenung, NEAspnes, GPolivkova, JGarcia-Irizarry, CNLi, QCanterbury, DNiosi, MVera, NBLi, ZKhunte, BSiderewicz, JRolph, TErion, DM Optimization of a Dicarboxylic Series for in Vivo Inhibition of Citrate Transport by the Solute Carrier 13 (SLC13) Family. J Med Chem59:1165-75 (2016) 
 
Solute carrier family 13 member 5
Name:Solute carrier family 13 member 5
Type:PROTEIN
Mol. Mass.:63069.06
Organism:Homo sapiens (Human)
Description:ChEMBL_116736
Residue:568
BDBM50149215
NameBDBM50149215
Synonyms:CHEMBL3769514
TypeSmall organic molecule
Emp. Form.C16H22O5
Mol. Mass.294.3429
SMILESCC(C)(C)c1ccc(CCC(O)(CC(O)=O)C(O)=O)cc1