Reaction Details
TargetSolute carrier family 13 member 5
LigandBDBM50149291
Substrate/Competitorn/a
Meas. Tech.ChEMBL_1557732 (CHEMBL3773091)
IC50 110±n/a nM
Citation Huard, KGosset, JRMontgomery, JIGilbert, AHayward, MMMagee, TVCabral, SUccello, DPBahnck, KBrown, JPurkal, JGorgoglione, MLanba, AFutatsugi, KHerr, MGenung, NEAspnes, GPolivkova, JGarcia-Irizarry, CNLi, QCanterbury, DNiosi, MVera, NBLi, ZKhunte, BSiderewicz, JRolph, TErion, DM Optimization of a Dicarboxylic Series for in Vivo Inhibition of Citrate Transport by the Solute Carrier 13 (SLC13) Family. J Med Chem59:1165-75 (2016) 
 
Solute carrier family 13 member 5
Name:Solute carrier family 13 member 5
Type:PROTEIN
Mol. Mass.:63069.06
Organism:Homo sapiens (Human)
Description:ChEMBL_116736
Residue:568
BDBM50149291
NameBDBM50149291
Synonyms:CHEMBL3770609
TypeSmall organic molecule
Emp. Form.C13H17NO6
Mol. Mass.283.2772
SMILESCCOc1ncccc1CC[C@@](O)(CC(O)=O)C(O)=O