Reaction Details
TargetdCTP pyrophosphatase 1
LigandBDBM50150052
Substrate/Competitorn/a
Meas. Tech.ChEBML_1558383
IC50 47±n/a nM
Citation Llona-Minguez, SHöglund, AJacques, SAJohansson, LCalderón-Montaño, JMClaesson, MLoseva, OValerie, NCLundbäck, TPiedrafita, JMaga, GCrespan, EMeijer, LBurgos Morón, EBaranczewski, PHagbjörk, ALSvensson, RWiita, EAlmlöf, IVisnes, TJeppsson, FSigmundsson, KJensen, AJArtursson, PJemth, ASStenmark, PWarpman Berglund, UScobie, MHelleday, T Discovery of the First Potent and Selective Inhibitors of Human dCTP Pyrophosphatase 1. J Med Chem59:1140-8 (2016) 
 
dCTP pyrophosphatase 1
Name:dCTP pyrophosphatase 1
Type:Protein
Mol. Mass.:18673.58
Organism:Homo sapiens (Human)
Description:Q9H773
Residue:170
BDBM50150052
NameBDBM50150052
Synonyms:CHEMBL3771105
TypeSmall organic molecule
Emp. Form.C20H17BCl2N4O6
Mol. Mass.491.089
SMILESCN1CC(=O)OB(OC(=O)C1)c1ccc(Cn2c(C)nc3c(c(Cl)c(Cl)cc23)[N+]([O-])=O)cc1