Reaction Details
TargetKallikrein-2
LigandBDBM50292533
Substrate/Competitorn/a
Meas. Tech.ChEMBL_1558619 (CHEMBL3774272)
IC50 3200±n/a nM
Citation Santos, JAKondo, MYFreitas, RFdos Santos, MHRamalho, TCAssis, DMJuliano, LJuliano, MAPuzer, L The natural flavone fukugetin as a mixed-type inhibitor for human tissue kallikreins. Bioorg Med Chem Lett26:1485-9 (2016) 
 
Kallikrein-2
Name:Kallikrein-2
Type:PROTEIN
Mol. Mass.:28673.68
Organism:Homo sapiens (Human)
Description:ChEMBL_862797
Residue:261
BDBM50292533
NameBDBM50292533
Synonyms:CHEMBL446790 | Fukugetin
TypeSmall organic molecule
Emp. Form.C30H22O11
Mol. Mass.558.4891
SMILESOc1ccc(cc1)[C@@H]1Oc2cc(O)cc(O)c2C(=O)[C@H]1c1c(O)cc(O)c2C(=O)CC(Oc12)c1ccc(O)c(O)c1