Reaction Details
TargetKallikrein-1
LigandBDBM50292533
Substrate/Competitorn/a
Meas. Tech.ChEMBL_1558632 (CHEMBL3774285)
Ki 3600±n/a nM
Citation Santos, JAKondo, MYFreitas, RFdos Santos, MHRamalho, TCAssis, DMJuliano, LJuliano, MAPuzer, L The natural flavone fukugetin as a mixed-type inhibitor for human tissue kallikreins. Bioorg Med Chem Lett26:1485-9 (2016) 
 
Kallikrein-1
Name:Kallikrein-1
Type:Enzyme
Mol. Mass.:28874.69
Organism:Homo sapiens (Human)
Description:P06870
Residue:262
BDBM50292533
NameBDBM50292533
Synonyms:CHEMBL446790 | Fukugetin
TypeSmall organic molecule
Emp. Form.C30H22O11
Mol. Mass.558.4891
SMILESOc1ccc(cc1)[C@@H]1Oc2cc(O)cc(O)c2C(=O)[C@H]1c1c(O)cc(O)c2C(=O)CC(Oc12)c1ccc(O)c(O)c1