Reaction Details
TargetCoagulation factor IX
LigandBDBM50125977
Substrate/Competitorn/a
Meas. Tech.ChEBML_1560117
Ki 9.1±n/a nM
Citation Zhang, TLiu, YYang, XMartin, GEYao, HShang, JBugianesi, RMEllsworth, KPSonatore, LMNizner, PSherer, ECHill, SEKnemeyer, IWGeissler, WMDandliker, PJHelmy, RWood, HB Definitive Metabolite Identification Coupled with Automated Ligand Identification System (ALIS) Technology: A Novel Approach to Uncover Structure-Activity Relationships and Guide Drug Design in a Factor IXa Inhibitor Program. J Med Chem59:1818-29 (2016) 
 
Coagulation factor IX
Name:Coagulation factor IX
Type:Enzyme
Mol. Mass.:51768.83
Organism:Homo sapiens (Human)
Description:P00740
Residue:461
BDBM50125977
NameBDBM50125977
Synonyms:CHEMBL3627897
TypeSmall organic molecule
Emp. Form.C26H21Cl2FN6O
Mol. Mass.523.389
SMILESCc1ncn(n1)-c1cc(Cl)c(C(=O)NC[C@@H](c2cccc(F)c2)c2ccc3[nH]c(C)nc3c2)c(Cl)c1