Reaction Details
TargetCoagulation factor IX
LigandBDBM50151406
Substrate/Competitorn/a
Meas. Tech.ChEBML_1560117
IC50 1.9±n/a nM
Citation Zhang, TLiu, YYang, XMartin, GEYao, HShang, JBugianesi, RMEllsworth, KPSonatore, LMNizner, PSherer, ECHill, SEKnemeyer, IWGeissler, WMDandliker, PJHelmy, RWood, HB Definitive Metabolite Identification Coupled with Automated Ligand Identification System (ALIS) Technology: A Novel Approach to Uncover Structure-Activity Relationships and Guide Drug Design in a Factor IXa Inhibitor Program. J Med Chem59:1818-29 (2016) 
 
Coagulation factor IX
Name:Coagulation factor IX
Type:Enzyme
Mol. Mass.:51768.83
Organism:Homo sapiens (Human)
Description:P00740
Residue:461
BDBM50151406
NameBDBM50151406
Synonyms:CHEMBL3774670
TypeSmall organic molecule
Emp. Form.C26H21Cl2FN6O2
Mol. Mass.539.388
SMILESCc1ncn(n1)-c1cc(Cl)c(C(=O)NC[C@@H](c2ccc(O)c(F)c2)c2ccc3[nH]c(C)nc3c2)c(Cl)c1