Reaction Details
TargetLysine-specific demethylase 4C
LigandBDBM50151402
Substrate/Competitorn/a
Meas. Tech.ChEMBL_1561029 (CHEMBL3776325)
IC50 770±n/a nM
Citation Korczynska, MLe, DDYounger, NGregori-Puigjané, ETumber, AKrojer, TVelupillai, SGileadi, CNowak, RPIwasa, EPollock, SBOrtiz Torres, IOppermann, UShoichet, BKFujimori, DG Docking and Linking of Fragments To Discover Jumonji Histone Demethylase Inhibitors. J Med Chem59:1580-98 (2016) 
 
Lysine-specific demethylase 4C
Name:Lysine-specific demethylase 4C
Type:Protein
Mol. Mass.:119979.01
Organism:Homo sapiens (Human)
Description:Q9H3R0
Residue:1056
BDBM50151402
NameBDBM50151402
Synonyms:CHEMBL3774573
TypeSmall organic molecule
Emp. Form.C17H16N4O3
Mol. Mass.324.3339
SMILESCn1nccc1CNc1ccc(O)c(c1)-c1cc(ccn1)C(O)=O