Reaction Details
TargetHypoxia-inducible factor 1-alpha inhibitor
LigandBDBM26113
Substrate/Competitorn/a
Meas. Tech.ChEMBL_1561035 (CHEMBL3776331)
IC50 8600±n/a nM
Citation Korczynska, MLe, DDYounger, NGregori-Puigjané, ETumber, AKrojer, TVelupillai, SGileadi, CNowak, RPIwasa, EPollock, SBOrtiz Torres, IOppermann, UShoichet, BKFujimori, DG Docking and Linking of Fragments To Discover Jumonji Histone Demethylase Inhibitors. J Med Chem59:1580-98 (2016) 
 
Hypoxia-inducible factor 1-alpha inhibitor
Name:Hypoxia-inducible factor 1-alpha inhibitor
Type:Enzyme
Mol. Mass.:40278.92
Organism:Homo sapiens (Human)
Description:Q9NWT6
Residue:349
BDBM26113
NameBDBM26113
Synonyms:2,4 PDCA pyridine carboxylate, 6a | pyridine-2,4-dicarboxylic acid
TypeSmall organic molecule
Emp. Form.C7H5NO4
Mol. Mass.167.1189
SMILESOC(=O)c1ccnc(c1)C(O)=O