Reaction Details
TargetLysine-specific demethylase 6B
LigandBDBM50151399
Substrate/Competitorn/a
Meas. Tech.ChEMBL_1561039 (CHEMBL3776335)
IC50>100000±n/a nM
Citation Korczynska, MLe, DDYounger, NGregori-Puigjané, ETumber, AKrojer, TVelupillai, SGileadi, CNowak, RPIwasa, EPollock, SBOrtiz Torres, IOppermann, UShoichet, BKFujimori, DG Docking and Linking of Fragments To Discover Jumonji Histone Demethylase Inhibitors. J Med Chem59:1580-98 (2016) 
 
Lysine-specific demethylase 6B
Name:Lysine-specific demethylase 6B
Type:Protein
Mol. Mass.:176672.55
Organism:Homo sapiens (Human)
Description:O15054
Residue:1643
BDBM50151399
NameBDBM50151399
Synonyms:CHEMBL3775380
TypeSmall organic molecule
Emp. Form.C15H14N2O5
Mol. Mass.302.2821
SMILESCOCC(=O)Nc1ccc(O)c(c1)-c1cc(ccn1)C(O)=O