Reaction Details
TargetLysine-specific demethylase 5B
LigandBDBM50151393
Substrate/Competitorn/a
Meas. Tech.ChEMBL_1561040 (CHEMBL3776336)
IC50 2700±n/a nM
Citation Korczynska, MLe, DDYounger, NGregori-Puigjané, ETumber, AKrojer, TVelupillai, SGileadi, CNowak, RPIwasa, EPollock, SBOrtiz Torres, IOppermann, UShoichet, BKFujimori, DG Docking and Linking of Fragments To Discover Jumonji Histone Demethylase Inhibitors. J Med Chem59:1580-98 (2016) 
 
Lysine-specific demethylase 5B
Name:Lysine-specific demethylase 5B
Type:Protein
Mol. Mass.:175659.67
Organism:Homo sapiens (Human)
Description:Q9UGL1
Residue:1544
BDBM50151393
NameBDBM50151393
Synonyms:CHEMBL3775867
TypeSmall organic molecule
Emp. Form.C17H13N3O5
Mol. Mass.339.3022
SMILESCc1cc(no1)C(=O)Nc1ccc(O)c(c1)-c1cc(ccn1)C(O)=O