Reaction Details
TargetLysine-specific demethylase 5B
LigandBDBM50151399
Substrate/Competitorn/a
Meas. Tech.ChEMBL_1561040 (CHEMBL3776336)
IC50 12000±n/a nM
Citation Korczynska, MLe, DDYounger, NGregori-Puigjané, ETumber, AKrojer, TVelupillai, SGileadi, CNowak, RPIwasa, EPollock, SBOrtiz Torres, IOppermann, UShoichet, BKFujimori, DG Docking and Linking of Fragments To Discover Jumonji Histone Demethylase Inhibitors. J Med Chem59:1580-98 (2016) 
 
Lysine-specific demethylase 5B
Name:Lysine-specific demethylase 5B
Type:Protein
Mol. Mass.:175659.67
Organism:Homo sapiens (Human)
Description:Q9UGL1
Residue:1544
BDBM50151399
NameBDBM50151399
Synonyms:CHEMBL3775380
TypeSmall organic molecule
Emp. Form.C15H14N2O5
Mol. Mass.302.2821
SMILESCOCC(=O)Nc1ccc(O)c(c1)-c1cc(ccn1)C(O)=O