Reaction Details
TargetCREB-binding protein
LigandBDBM50151661
Substrate/Competitorn/a
Meas. Tech.ChEMBL_1561483 (CHEMBL3779620)
Kd 390±n/a nM
Citation Simon, RPRobaa, DAlhalabi, ZSippl, WJung, M KATching-Up on Small Molecule Modulators of Lysine Acetyltransferases. J Med Chem59:1249-70 (2016) 
 
CREB-binding protein
Name:CREB-binding protein
Type:Transcription Coactivator
Mol. Mass.:265411.66
Organism:Homo sapiens (Human)
Description:Q92793
Residue:2442
BDBM50151661
NameBDBM50151661
Synonyms:CHEMBL3752296
TypeSmall organic molecule
Emp. Form.C23H28N4O3
Mol. Mass.408.4934
SMILESCOc1ccc2CCCN(CCCNC(=O)c3cccc4NC(=O)[C@@H](C)Nc34)c2c1