Reaction Details
TargetBromodomain-containing protein 4
LigandBDBM50151661
Substrate/Competitorn/a
Meas. Tech.ChEMBL_1561484 (CHEMBL3779621)
Kd 1400±n/a nM
Citation Simon, RPRobaa, DAlhalabi, ZSippl, WJung, M KATching-Up on Small Molecule Modulators of Lysine Acetyltransferases. J Med Chem59:1249-70 (2016) 
 
Bromodomain-containing protein 4
Name:Bromodomain-containing protein 4
Type:Protein
Mol. Mass.:152264.84
Organism:Homo sapiens (Human)
Description:O60885
Residue:1362
BDBM50151661
NameBDBM50151661
Synonyms:CHEMBL3752296
TypeSmall organic molecule
Emp. Form.C23H28N4O3
Mol. Mass.408.4934
SMILESCOc1ccc2CCCN(CCCNC(=O)c3cccc4NC(=O)[C@@H](C)Nc34)c2c1