Reaction Details
TargetFarnesyl pyrophosphate synthase
LigandBDBM50151852
Substrate/Competitorn/a
Meas. Tech.ChEMBL_1561703 (CHEMBL3777121)
IC50 13000±n/a nM
Citation Wills, VSAllen, CHolstein, SAWiemer, DF Potent Triazole Bisphosphonate Inhibitor of Geranylgeranyl Diphosphate Synthase. ACS Med Chem Lett6:1195-8 (2015) 
 
Farnesyl pyrophosphate synthase
Name:Farnesyl pyrophosphate synthase
Type:Enzyme
Mol. Mass.:48272.89
Organism:Homo sapiens (Human)
Description:P14324
Residue:419
BDBM50151852
NameBDBM50151852
Synonyms:CHEMBL3775694
TypeSmall organic molecule
Emp. Form.C20H31N3Na4O6P2
Mol. Mass.563.3832
SMILES[Na+].[Na+].[Na+].[Na+].[#6]\[#6](-[#6])=[#6]/[#6]-[#6]\[#6](-[#6])=[#6]\[#6]C([#6]-c1cn(-[#6]-[#6]\[#6]=[#6](\[#6])-[#6])nn1)(P([#8-])([#8-])=O)P([#8-])([#8-])=O