Reaction Details
TargetVascular endothelial growth factor receptor 2
LigandBDBM21
Substrate/Competitorn/a
Meas. Tech.ChEMBL_1560167 (CHEMBL3778238)
IC50 175±n/a nM
Citation Newton, RBowler, KABurns, EMChapman, PJFairweather, EEFritzl, SJGoldberg, KMHamilton, NMHolt, SVHopkins, GVJones, SDJordan, AMLyons, AJNikki March, HMcDonald, NQMaguire, LAMould, DPPurkiss, AGSmall, HFStowell, AIThomson, GJWaddell, IDWaszkowycz, BWatson, AJOgilvie, DJ The discovery of 2-substituted phenol quinazolines as potent RET kinase inhibitors with improved KDR selectivity. Eur J Med Chem112:20-32 (2016) 
 
Vascular endothelial growth factor receptor 2
Name:Vascular endothelial growth factor receptor 2
Type:Receptor Tyrosine Kinase
Mol. Mass.:151510.97
Organism:Homo sapiens (Human)
Description:P35968
Residue:1356
BDBM21
NameBDBM21
Synonyms:CHEMBL24828 VANDETANIB ZD6474 | cid_3081361
Typen/a
Emp. Form.C22H24BrFN4O2
Mol. Mass.475.354
SMILESCOc1cc2c(Nc3ccc(Br)cc3F)ncnc2cc1OCC1CCN(C)CC1