Reaction Details
TargetProto-oncogene tyrosine-protein kinase receptor Ret
LigandBDBM50153904
Substrate/Competitorn/a
Meas. Tech.ChEMBL_1560166 (CHEMBL3778237)
IC50 13±n/a nM
Citation Newton, RBowler, KABurns, EMChapman, PJFairweather, EEFritzl, SJGoldberg, KMHamilton, NMHolt, SVHopkins, GVJones, SDJordan, AMLyons, AJNikki March, HMcDonald, NQMaguire, LAMould, DPPurkiss, AGSmall, HFStowell, AIThomson, GJWaddell, IDWaszkowycz, BWatson, AJOgilvie, DJ The discovery of 2-substituted phenol quinazolines as potent RET kinase inhibitors with improved KDR selectivity. Eur J Med Chem112:20-32 (2016) 
 
Proto-oncogene tyrosine-protein kinase receptor Ret
Name:Proto-oncogene tyrosine-protein kinase receptor Ret
Type:Protein
Mol. Mass.:124318.29
Organism:Homo sapiens (Human)
Description:P07949
Residue:1114
BDBM50153904
NameBDBM50153904
Synonyms:CHEMBL3775415
TypeSmall organic molecule
Emp. Form.C17H16ClN3O3
Mol. Mass.345.78
SMILESCOc1cc2ncnc(Nc3cc(O)c(C)cc3Cl)c2cc1OC