Reaction Details
TargetCocaine esterase
LigandBDBM50058817
Substrate/Competitorn/a
Meas. Tech.ChEMBL_1561176 (CHEMBL3777369)
IC50 5610±n/a nM
Citation Zou, LWLi, YGWang, PZhou, KHou, JJin, QHao, DCGe, GBYang, L Design, synthesis, and structure-activity relationship study of glycyrrhetinic acid derivatives as potent and selective inhibitors against human carboxylesterase 2. Eur J Med Chem112:280-8 (2016) 
 
Cocaine esterase
Name:Cocaine esterase
Type:PROTEIN
Mol. Mass.:61801.08
Organism:Homo sapiens (Human)
Description:ChEMBL_1494240
Residue:559
BDBM50058817
NameBDBM50058817
Synonyms:CHEMBL1271483
TypeSmall organic molecule
Emp. Form.C31H48O4
Mol. Mass.484.7104
SMILES[H][C@@]12C[C@](C)(CC[C@]1(C)CC[C@]1(C)C2=CC(=O)[C@]2([H])[C@@]3(C)CC[C@H](O)C(C)(C)[C@]3([H])CC[C@@]12C)C(=O)OC