Reaction Details
TargetPAS domain-containing serine/threonine-protein kinase
LigandBDBM50154943
Substrate/Competitorn/a
Meas. Tech.ChEMBL_1562265 (CHEMBL3776910)
IC50 260±n/a nM
Citation Schiemann, KMallinger, AWienke, DEsdar, CPoeschke, OBusch, MRohdich, FEccles, SASchneider, RRaynaud, FICzodrowski, PMusil, DSchwarz, DUrbahns, KBlagg, J Discovery of potent and selective CDK8 inhibitors from an HSP90 pharmacophore. Bioorg Med Chem Lett26:1443-51 (2016) 
 
PAS domain-containing serine/threonine-protein kinase
Name:PAS domain-containing serine/threonine-protein kinase
Type:PROTEIN
Mol. Mass.:142867.26
Organism:Homo sapiens (Human)
Description:ChEMBL_944230
Residue:1323
BDBM50154943
NameBDBM50154943
Synonyms:CHEMBL3775576
TypeSmall organic molecule
Emp. Form.C18H17N5O
Mol. Mass.319.3605
SMILESCNC(=O)c1ccc2[nH]nc(Cc3ccc4n(C)ncc4c3)c2c1