Reaction Details
TargetCyclin-C
LigandBDBM50154956
Substrate/Competitorn/a
Meas. Tech.ChEMBL_1562026 (CHEMBL3779200)
IC50 6.0±n/a nM
Citation Schiemann, KMallinger, AWienke, DEsdar, CPoeschke, OBusch, MRohdich, FEccles, SASchneider, RRaynaud, FICzodrowski, PMusil, DSchwarz, DUrbahns, KBlagg, J Discovery of potent and selective CDK8 inhibitors from an HSP90 pharmacophore. Bioorg Med Chem Lett26:1443-51 (2016) 
 
Cyclin-C
Name:Cyclin-C
Type:PROTEIN
Mol. Mass.:33244.88
Organism:Homo sapiens (Human)
Description:ChEMBL_107900
Residue:283
BDBM50154956
NameBDBM50154956
Synonyms:CHEMBL3775317
TypeSmall organic molecule
Emp. Form.C23H23N5O2
Mol. Mass.401.461
SMILESCn1cc(cn1)-c1ccc(Cc2n[nH]c3ccc(cc23)C(=O)N2CC[C@@H](O)C2)cc1