Reaction Details
TargetHepatocyte growth factor activator
LigandBDBM50157633
Substrate/Competitorn/a
Meas. Tech.ChEMBL_1565754 (CHEMBL3782552)
Ki 1110±n/a nM
Citation Venukadasula, PKOwusu, BYBansal, NRoss, LJHobrath, JVBao, DTruss, JWStackhouse, MMessick, TEKlampfer, LGalemmo, RA Design and Synthesis of Nonpeptide Inhibitors of Hepatocyte Growth Factor Activation. ACS Med Chem Lett7:177-81 (2016) 
 
Hepatocyte growth factor activator
Name:Hepatocyte growth factor activator
Type:PROTEIN
Mol. Mass.:70690.18
Organism:Homo sapiens (Human)
Description:ChEMBL_109514
Residue:655
BDBM50157633
NameBDBM50157633
Synonyms:CHEMBL3779949
TypeSmall organic molecule
Emp. Form.C26H35N5O
Mol. Mass.433.589
SMILESCC1CN(CCC2CCN(Cc3ccccc3)CC2)C(=O)N(C1)c1cccc(c1)C(N)=N