Reaction Details
TargetTyrosine-protein kinase JAK1
LigandBDBM50157879
Substrate/Competitorn/a
Meas. Tech.ChEMBL_1570041 (CHEMBL3789404)
IC50>10000±n/a nM
Citation Stauffer, FCowan-Jacob, SWScheufler, CFuret, P Identification of a 5-[3-phenyl-(2-cyclic-ether)-methylether]-4-aminopyrrolo[2,3-d]pyrimidine series of IGF-1R inhibitors. Bioorg Med Chem Lett26:2065-7 (2016) 
 
Tyrosine-protein kinase JAK1
Name:Tyrosine-protein kinase JAK1
Type:Protein
Mol. Mass.:133293.73
Organism:Homo sapiens (Human)
Description:P23458
Residue:1154
BDBM50157879
NameBDBM50157879
Synonyms:CHEMBL1614712
TypeSmall organic molecule
Emp. Form.C27H29N5O
Mol. Mass.439.5521
SMILES[H][C@]1(CN2CCC2)C[C@]([H])(C1)n1cc(-c2cccc(OCc3ccccc3)c2)c2c(N)ncnc12