Reaction Details
TargetRetinoic acid receptor RXR-alpha
LigandBDBM50158082
Substrate/Competitorn/a
Meas. Tech.ChEMBL_1564170 (CHEMBL3784067)
EC50 50±n/a nM
Citation Sundén, HSchäfer, AScheepstra, MLeysen, SMalo, MMa, JNBurstein, ESOttmann, CBrunsveld, LOlsson, R Chiral Dihydrobenzofuran Acids Show Potent Retinoid X Receptor-Nuclear Receptor Related 1 Protein Dimer Activation. J Med Chem59:1232-8 (2016) 
 
Retinoic acid receptor RXR-alpha
Name:Retinoic acid receptor RXR-alpha
Type:PROTEIN
Mol. Mass.:50820.38
Organism:Homo sapiens (Human)
Description:ChEMBL_1456363
Residue:462
BDBM50158082
NameBDBM50158082
Synonyms:CHEMBL3781998
TypeSmall organic molecule
Emp. Form.C27H31FO3
Mol. Mass.422.5316
SMILESCC1(C)CCC(C)(C)c2cc3c(OC4CCCCC34c3ccc(C(O)=O)c(F)c3)cc12