Reaction Details
TargetRetinoic acid receptor RXR-alpha
LigandBDBM50158079
Substrate/Competitorn/a
Meas. Tech.ChEMBL_1564170 (CHEMBL3784067)
EC50 126±n/a nM
Citation Sundén, HSchäfer, AScheepstra, MLeysen, SMalo, MMa, JNBurstein, ESOttmann, CBrunsveld, LOlsson, R Chiral Dihydrobenzofuran Acids Show Potent Retinoid X Receptor-Nuclear Receptor Related 1 Protein Dimer Activation. J Med Chem59:1232-8 (2016) 
 
Retinoic acid receptor RXR-alpha
Name:Retinoic acid receptor RXR-alpha
Type:PROTEIN
Mol. Mass.:50820.38
Organism:Homo sapiens (Human)
Description:ChEMBL_1456363
Residue:462
BDBM50158079
NameBDBM50158079
Synonyms:CHEMBL3781771
TypeSmall organic molecule
Emp. Form.C28H34O3
Mol. Mass.418.5678
SMILES[H][C@]12CCCCC[C@]1(c1cc3c(cc1O2)C(C)(C)CCC3(C)C)c1ccc(cc1)C(O)=O